Target
Interleukin-1 receptor-associated kinase 4
Ligand
BDBM319571
Substrate
Meas. Tech.
IRAK4 Enzymatic DELFIA Assay, Protocol B
IC50
110±n/a nM
Citation
 Lee, KLAllais, CPDehnhardt, CMGavrin, LKHan, SHepworth, DLee, ALovering, FEMathias, JPOwen, DRPapaioannou, NSaiah, EStrohbach, JWTrzupek, JDWright, SWZapf, CW Bicyclic-fused heteroaryl or aryl compounds as IRAK4 modulators US Patent  US10174000 Publication Date 1/8/2019 
Target
Name:
Interleukin-1 receptor-associated kinase 4
Synonyms:
IRAK-4 IRAK4_HUMAN Interleukin-1 receptor-associated kinase 4 (IRAK4) | Renal carcinoma antigen NY-REN-64
Type:
Protein
Mol. Mass.:
51519.08
Organism:
Homo sapiens (Human)
Description:
Q9NWZ3
Residue:
460
  
Inhibitor
Name:
BDBM319571
Synonyms:
1-(((4R,7R)-7-fluoro-6-oxo-5-azaspiro[2.4]heptan-4-yl)methoxy)-7-methoxyisoquinoline-6-carboxamide | US10174000, Example 23
Type:
Small organic molecule
Emp. Form.:
C18H18FN3O4
Mol. Mass.:
359.3516
SMILES:
COc1cc2c(OC[C@@H]3NC(=O)[C@H](F)C33CC3)nccc2cc1C(N)=O
: