Target
Interleukin-1 receptor-associated kinase 4
Ligand
BDBM319573
Substrate
Meas. Tech.
IRAK4 Enzymatic DELFIA Assay, Protocol B
IC50
2.70±n/a nM
Citation
 Lee, KLAllais, CPDehnhardt, CMGavrin, LKHan, SHepworth, DLee, ALovering, FEMathias, JPOwen, DRPapaioannou, NSaiah, EStrohbach, JWTrzupek, JDWright, SWZapf, CW Bicyclic-fused heteroaryl or aryl compounds as IRAK4 modulators US Patent  US10174000 Publication Date 1/8/2019 
Target
Name:
Interleukin-1 receptor-associated kinase 4
Synonyms:
IRAK-4 IRAK4_HUMAN Interleukin-1 receptor-associated kinase 4 (IRAK4) | Renal carcinoma antigen NY-REN-64
Type:
Protein
Mol. Mass.:
51519.08
Organism:
Homo sapiens (Human)
Description:
Q9NWZ3
Residue:
460
  
Inhibitor
Name:
BDBM319573
Synonyms:
4-(((2S,3R)-3-ethyl-5-oxopyrrolidin-2-yl)methoxy)-6-methoxyisoquinoline-7-carboxamide | US10174000, Example 25
Type:
Small organic molecule
Emp. Form.:
C18H21N3O4
Mol. Mass.:
343.377
SMILES:
CC[C@@H]1CC(=O)N[C@@H]1COc1cncc2cc(C(N)=O)c(OC)cc12
: