Target
Interleukin-1 receptor-associated kinase 4
Ligand
BDBM319577
Substrate
Meas. Tech.
IRAK4 Enzymatic DELFIA Assay, Protocol B
IC50
350±n/a nM
Citation
 Lee, KLAllais, CPDehnhardt, CMGavrin, LKHan, SHepworth, DLee, ALovering, FEMathias, JPOwen, DRPapaioannou, NSaiah, EStrohbach, JWTrzupek, JDWright, SWZapf, CW Bicyclic-fused heteroaryl or aryl compounds as IRAK4 modulators US Patent  US10174000 Publication Date 1/8/2019 
Target
Name:
Interleukin-1 receptor-associated kinase 4
Synonyms:
IRAK-4 IRAK4_HUMAN Interleukin-1 receptor-associated kinase 4 (IRAK4) | Renal carcinoma antigen NY-REN-64
Type:
Protein
Mol. Mass.:
51519.08
Organism:
Homo sapiens (Human)
Description:
Q9NWZ3
Residue:
460
  
Inhibitor
Name:
BDBM319577
Synonyms:
7-methoxy-1-[(3-oxo-2-azabicyclo[3.1.0]hex-1-yl)methoxy]isoquinoline-6-carboxamide | US10174000, Example 29
Type:
Small organic molecule
Emp. Form.:
C17H17N3O4
Mol. Mass.:
327.3346
SMILES:
COc1cc2c(OCC34CC3CC(=O)N4)nccc2cc1C(N)=O
: