Target
Interleukin-1 receptor-associated kinase 4
Ligand
BDBM319580
Substrate
Meas. Tech.
IRAK4 Enzymatic DELFIA Assay, Protocol A
IC50
27.0±n/a nM
Citation
 Lee, KLAllais, CPDehnhardt, CMGavrin, LKHan, SHepworth, DLee, ALovering, FEMathias, JPOwen, DRPapaioannou, NSaiah, EStrohbach, JWTrzupek, JDWright, SWZapf, CW Bicyclic-fused heteroaryl or aryl compounds as IRAK4 modulators US Patent  US10174000 Publication Date 1/8/2019 
Target
Name:
Interleukin-1 receptor-associated kinase 4
Synonyms:
IRAK-4 IRAK4_HUMAN Interleukin-1 receptor-associated kinase 4 (IRAK4) | Renal carcinoma antigen NY-REN-64
Type:
Protein
Mol. Mass.:
51519.08
Organism:
Homo sapiens (Human)
Description:
Q9NWZ3
Residue:
460
  
Inhibitor
Name:
BDBM319580
Synonyms:
5-{[(2S,3S,4S)-3-ethyl-4-fluoro-5-oxopyrrolidin-2-yl]methoxy}-3-methoxy-1,6-naphthyridine-2-carboxamide | US10174000, Example 32
Type:
Small organic molecule
Emp. Form.:
C17H19FN4O4
Mol. Mass.:
362.3556
SMILES:
CC[C@H]1[C@@H](COc2nccc3nc(C(N)=O)c(OC)cc23)NC(=O)[C@H]1F
: