Target
Dipeptidyl peptidase 9
Ligand
BDBM11189
Substrate
BDBM11057
Meas. Tech.
Dipeptidyl Peptidase Inhibition Assay
IC50
86000±n/a nM
Citation
 Edmondson, SDMastracchio, ADuffy, JLEiermann, GJHe, HIta, ILeiting, BLeone, JFLyons, KAMakarewicz, AMPatel, RAPetrov, AWu, JKThornberry, NAWeber, AE Discovery of potent and selective orally bioavailable beta-substituted phenylalanine derived dipeptidyl peptidase IV inhibitors. Bioorg Med Chem Lett 15:3048-52 (2005)  
Target
Name:
Dipeptidyl peptidase 9
Synonyms:
DPP9 DPRP-2 Dipeptidyl peptidase 9 (DDP9) Dipeptidyl peptidase 9 (DPP9) Dipeptidyl peptidase IX Dipeptidyl peptidase-like protein 9
Type:
Enzyme
Mol. Mass.:
98260.70
Organism:
Homo sapiens (Human)
Description:
Q86TI2
Residue:
863
  
Inhibitor
Name:
BDBM11189
Synonyms:
(2S,3S)-3-[4-(4-fluorophenyl)phenyl]-1-[(3S)-3-fluoropyrrolidin-1-yl]-1-oxobutan-2-aminium; 2,2,2-trifluoroacetate beta-substituted phenylalanine deriv. 14 | phenylalanine derived inhibitor, 4
Type:
Small organic molecule
Emp. Form.:
C20H23F2N2O
Mol. Mass.:
345.4057
SMILES:
C[C@H]([C@H]([NH3+])C(=O)N1CC[C@H](F)C1)c1ccc(cc1)-c1ccc(F)cc1
:
Substrate
Name:
BDBM11057
Synonyms:
1-(2-aminoacetyl)-N-(4-methyl-2-oxo-2H-chromen-7-yl)pyrrolidine-2-carboxamide hydrobromide Gly-Pro-7-amidomethylcoumarin | Gly-Pro-AMC
Type:
Small organic molecule
Emp. Form.:
C17H19N3O4
Mol. Mass.:
329.3505
SMILES:
Cc1cc(=O)oc2cc(NC(=O)C3CCCN3C(=O)CN)ccc12
: