Target
P2X purinoceptor 3
Ligand
BDBM319928
Substrate
Meas. Tech.
Intracellular Calcium Measurement to Assess Antagonist Activity at Human P2X3 and Human P2X2/3 Receptors
IC50
2.00±n/a nM
Citation
 Davenport, AJBräuer, NFischer, OMRotgeri, ARottmann, ANeagoe, INagel, JGodinho-Coelho, AKlar, J 1,3-thiazol-2-yl substituted benzamides US Patent  US10174016 Publication Date 1/8/2019 
Target
Name:
P2X purinoceptor 3
Synonyms:
ATP receptor P2RX3 P2X purinoceptor 3 P2X purinoceptor 3 (P2X3) P2X3 purinoceptor p2x3 + hsa
Type:
Protein
Mol. Mass.:
44292.02
Organism:
Homo sapiens (Human)
Description:
P56373
Residue:
397
  
Inhibitor
Name:
BDBM319928
Synonyms:
N-[1-(5- Chloro-3- fluoropyridin- 2-yl)ethyl]-3- (5-methyl- 1,3-thiazol-2- yl)-5- (tetrahydro- 2H-pyran--4- ylmethoxy) benzamide US10202369, Example 95 | US10472354, Example 95
Type:
Small organic molecule
Emp. Form.:
C24H25ClFN3O3S
Mol. Mass.:
489.99
SMILES:
CC(NC(=O)c1cc(OCC2CCOCC2)cc(c1)-c1ncc(C)s1)c1ncc(Cl)cc1F
: