Target
P2X purinoceptor 3
Ligand
BDBM319956
Substrate
Meas. Tech.
Intracellular Calcium Measurement to Assess Antagonist Activity at Human P2X3 and Human P2X2/3 Receptors
IC50
46.0±n/a nM
Citation
 Davenport, AJBräuer, NFischer, OMRotgeri, ARottmann, ANeagoe, INagel, JGodinho-Coelho, AKlar, J 1,3-thiazol-2-yl substituted benzamides US Patent  US10174016 Publication Date 1/8/2019 
Target
Name:
P2X purinoceptor 3
Synonyms:
ATP receptor P2RX3 P2X purinoceptor 3 P2X purinoceptor 3 (P2X3) P2X3 purinoceptor p2x3 + hsa
Type:
Protein
Mol. Mass.:
44292.02
Organism:
Homo sapiens (Human)
Description:
P56373
Residue:
397
  
Inhibitor
Name:
BDBM319956
Synonyms:
3-(5-Cyclobutyl-1,3-thiazol-2-yl)-5-[(3S)-tetrahydrofuran-3-ylmethoxy]-N-{(1R)-1-[2-(trifluoromethyl)pyrimidin-5-yl]ethyl}benzamide US10202369, Example 123 | US10472354, Example 272
Type:
Small organic molecule
Emp. Form.:
C26H27F3N4O3S
Mol. Mass.:
532.578
SMILES:
C[C@@H](NC(=O)c1cc(OC[C@H]2CCOC2)cc(c1)-c1ncc(s1)C1CCC1)c1cnc(nc1)C(F)(F)F
: