Target
P2X purinoceptor 3
Ligand
BDBM320216
Substrate
Meas. Tech.
Intracellular Calcium Measurement to Assess Antagonist Activity at Human P2X3 and Human P2X2/3 Receptors
IC50
2.00±n/a nM
Citation
 Davenport, AJBräuer, NFischer, OMRotgeri, ARottmann, ANeagoe, INagel, JGodinho-Coelho, AKlar, J 1,3-thiazol-2-yl substituted benzamides US Patent  US10174016 Publication Date 1/8/2019 
Target
Name:
P2X purinoceptor 3
Synonyms:
ATP receptor P2RX3 P2X purinoceptor 3 P2X purinoceptor 3 (P2X3) P2X3 purinoceptor p2x3 + hsa
Type:
Protein
Mol. Mass.:
44292.02
Organism:
Homo sapiens (Human)
Description:
P56373
Residue:
397
  
Inhibitor
Name:
BDBM320216
Synonyms:
3-{[4,4- difluoro-1- methylpiperidin- 3-yl]methoxy}-5- (5-methyl-1,3- thiazol-2-yl)- N-{(1R)-1-[2- (trifluoromethyl) pyrimidin-5- yl]ethyl} benzamide, as a mixture of 2 diastereoisomers US10202369, Example 384 | US10472354, Example 383
Type:
Small organic molecule
Emp. Form.:
C25H26F5N5O2S
Mol. Mass.:
555.563
SMILES:
C[C@@H](NC(=O)c1cc(OCC2CN(C)CCC2(F)F)cc(c1)-c1ncc(C)s1)c1cnc(nc1)C(F)(F)F
: