Target
Coagulation factor XI
Ligand
BDBM320038
Substrate
Meas. Tech.
In Vitro Inhibitory Effect of the Compounds of the Present Invention on the Enzymatic Activity of Blood-Coagulation Factor XIa
Ki
249±n/a nM
Citation
 Wei, YQiu, GZheng, SLei, BYu, YChen, Y Pyridone or pyrimidone derivative, preparation method therefor and application thereof US Patent  US10174020 Publication Date 1/8/2019 
Target
Name:
Coagulation factor XI
Synonyms:
Coagulation factor XIa Coagulation factor XIa light chain FA11_HUMAN Factor XIa PTA | Plasma thromboplastin antecedent
Type:
Enzyme
Mol. Mass.:
70130.58
Organism:
Homo sapiens (Human)
Description:
P03951
Residue:
625
  
Inhibitor
Name:
BDBM320038
Synonyms:
N-(4-carboxyphenyl)-2-(5-chloro-2-(1H-tetrazol-1-yl)phenyl)-4-oxo-4,6,7,8-tetrahydropyrrolo[1,2-a]pyrimidine-6-carboxamide | US10174020, Compound 1
Type:
Small organic molecule
Emp. Form.:
C22H16ClN7O4
Mol. Mass.:
477.86
SMILES:
OC(=O)c1ccc(NC(=O)C2CCc3nc(cc(=O)n23)-c2cc(Cl)ccc2-n2cnnn2)cc1
: