Target
Carbonic anhydrase 4
Ligand
BDBM11341
Substrate
BDBM11326
Meas. Tech.
Carbonic Anhydrase Enzyme Inhibition Assay
Ki
48±n/a nM
Citation
 Scozzafava, ASupuran, CT Carbonic anhydrase and matrix metalloproteinase inhibitors: sulfonylated amino acid hydroxamates with MMP inhibitory properties act as efficient inhibitors of CA isozymes I, II, and IV, and N-hydroxysulfonamides inhibit both these zinc enzymes. J Med Chem 43:3677-87 (2000)  
Target
Name:
Carbonic anhydrase 4
Synonyms:
CA-IV CAH4_BOVIN Carbonic Anhydrase IV Carbonic anhydrase 4
Type:
Enzyme
Mol. Mass.:
35152.74
Organism:
Bos taurus (bovine)
Description:
Bovine isozyme, isolated from lung microsomes
Residue:
312
  
Inhibitor
Name:
BDBM11341
Synonyms:
2-[benzyl(2,3,4,5,6-pentafluorobenzene)sulfonamido]-N-hydroxy-3-methylbutanamide | Hydroxamate 23
Type:
Small organic molecule
Emp. Form.:
C18H17F5N2O4S
Mol. Mass.:
452.396
SMILES:
CC(C)C(N(Cc1ccccc1)S(=O)(=O)c1c(F)c(F)c(F)c(F)c1F)C(=O)NO
:
Substrate
Name:
BDBM11326
Synonyms:
4-nitrophenyl acetate | p-Nitrophenyl Acetate
Type:
Small organic molecule
Emp. Form.:
C8H7NO4
Mol. Mass.:
181.1455
SMILES:
CC(=O)Oc1ccc(cc1)[N+]([O-])=O
: