Target
Interstitial collagenase
Ligand
BDBM11377
Substrate
BDBM11446
Meas. Tech.
Carbonic Anhydrase Enzyme Inhibition Assay
Ki
65000±n/a nM
Citation
 Scozzafava, ASupuran, CT Carbonic anhydrase and matrix metalloproteinase inhibitors: sulfonylated amino acid hydroxamates with MMP inhibitory properties act as efficient inhibitors of CA isozymes I, II, and IV, and N-hydroxysulfonamides inhibit both these zinc enzymes. J Med Chem 43:3677-87 (2000)  
Target
Name:
Interstitial collagenase
Synonyms:
CLG MMP1 Matrix metalloproteinase-1 | Matrix metalloproteinase-1 (MMP-1)
Type:
Enzyme
Mol. Mass.:
54010.26
Organism:
Homo sapiens (Human)
Description:
P03956
Residue:
469
  
Inhibitor
Name:
BDBM11377
Synonyms:
Hydroxysulfonamide 58 | N-hydroxy-4-methylbenzene-1-sulfonamide
Type:
Small organic molecule
Emp. Form.:
C7H9NO3S
Mol. Mass.:
187.216
SMILES:
Cc1ccc(cc1)S(=O)(=O)NO
:
Substrate
Name:
BDBM11446
Synonyms:
AcProLeuGly-S-LeuLeuGlyOEt | MMP Thioester Substrate
Type:
Emp. Form.:
Mol. Mass.:
SMILES:
: