Target
Matrix metalloproteinase-9
Ligand
BDBM11377
Substrate
BDBM11446
Meas. Tech.
Carbonic Anhydrase Enzyme Inhibition Assay
Ki
60000±n/a nM
Citation
 Scozzafava, ASupuran, CT Carbonic anhydrase and matrix metalloproteinase inhibitors: sulfonylated amino acid hydroxamates with MMP inhibitory properties act as efficient inhibitors of CA isozymes I, II, and IV, and N-hydroxysulfonamides inhibit both these zinc enzymes. J Med Chem 43:3677-87 (2000)  
Target
Name:
Matrix metalloproteinase-9
Synonyms:
67 kDa matrix metalloproteinase-9 92 kDa gelatinase CLG4B Gelatinase B MMP9 Matrix metalloproteinase 9 (MMP-9) Matrix metalloproteinase-9 (MMP9)
Type:
Enzyme
Mol. Mass.:
78452.28
Organism:
Homo sapiens (Human)
Description:
P14780
Residue:
707
  
Inhibitor
Name:
BDBM11377
Synonyms:
Hydroxysulfonamide 58 | N-hydroxy-4-methylbenzene-1-sulfonamide
Type:
Small organic molecule
Emp. Form.:
C7H9NO3S
Mol. Mass.:
187.216
SMILES:
Cc1ccc(cc1)S(=O)(=O)NO
:
Substrate
Name:
BDBM11446
Synonyms:
AcProLeuGly-S-LeuLeuGlyOEt | MMP Thioester Substrate
Type:
Emp. Form.:
Mol. Mass.:
SMILES:
: