Target
NEDD8-conjugating enzyme UBE2F
Ligand
BDBM321015
Substrate
Meas. Tech.
Nedd8 Conjugation Inhibitory Activity
IC50
9.70±n/a nM
Citation
 Mizutani, TYoshimura, CKondo, HKitade, MOhkubo, S Pyrrolopyrimidine compound or salt thereof and compositions containing the pyrrolopyrimidine compound or salt thereof US Patent  US10174040 Publication Date 1/8/2019 
Target
Name:
NEDD8-conjugating enzyme UBE2F
Synonyms:
NCE2 NEDD8 protein ligase UBE2F RING-type E3 NEDD8 transferase UBE2F UBE2F_HUMAN | Ubiquitin-conjugating enzyme E2 F
Type:
Enzyme Catalytic Domain
Mol. Mass.:
21077.76
Organism:
Homo sapiens (Human)
Description:
Q969M7
Residue:
185
  
Inhibitor
Name:
BDBM321015
Synonyms:
2-[2-[4-Amino-7-[(2R,3R,4S,5R)-3,4-dihydroxy-5-[(sulfamoylamino)methyl]tetrahydrofuran-2-yl]pyrrolo[2,3-d]pyrimidin-5-yl]ethynyl]-3-fluoro-benzenesulfonamide | US10174040, Example 84
Type:
Small organic molecule
Emp. Form.:
C19H20FN7O7S2
Mol. Mass.:
541.533
SMILES:
Nc1ncnc2n(cc(C#Cc3c(F)cccc3S(N)(=O)=O)c12)[C@@H]1O[C@H](CNS(N)(=O)=O)[C@@H](O)[C@H]1O
: