Target
NEDD8-conjugating enzyme UBE2F
Ligand
BDBM321029
Substrate
Meas. Tech.
Nedd8 Conjugation Inhibitory Activity
IC50
8.90±n/a nM
Citation
 Mizutani, TYoshimura, CKondo, HKitade, MOhkubo, S Pyrrolopyrimidine compound or salt thereof and compositions containing the pyrrolopyrimidine compound or salt thereof US Patent  US10174040 Publication Date 1/8/2019 
Target
Name:
NEDD8-conjugating enzyme UBE2F
Synonyms:
NCE2 NEDD8 protein ligase UBE2F RING-type E3 NEDD8 transferase UBE2F UBE2F_HUMAN | Ubiquitin-conjugating enzyme E2 F
Type:
Enzyme Catalytic Domain
Mol. Mass.:
21077.76
Organism:
Homo sapiens (Human)
Description:
Q969M7
Residue:
185
  
Inhibitor
Name:
BDBM321029
Synonyms:
4-Amino-5-[2-[2,6-difluoro-4-(pyrazol-1-ylmethoxy)phenyl]ethynyl]-7-[(1R,2S,3R,4R)-2,3-dihydroxy-4-[(sulfamoylamino)methyl]cyclopentyl]pyrrolo[2,3-d]pyrimidine | US10174040, Example 104
Type:
Small organic molecule
Emp. Form.:
C24H24F2N8O5S
Mol. Mass.:
574.56
SMILES:
Nc1ncnc2n(cc(C#Cc3c(F)cc(OCn4cccn4)cc3F)c12)[C@@H]1C[C@H](CNS(N)(=O)=O)[C@@H](O)[C@H]1O
: