Target
Sigma non-opioid intracellular receptor 1
Ligand
BDBM321267
Substrate
Meas. Tech.
Binding Assay to Sigma Receptors
Ki
3.20±n/a nM
Citation
 Melnyk, PVermersch, PCarato, POxombre-Vanteghem, BZephir, HDonnier-Marechal, M Compounds, pharmaceutical composition and their use in treating neurodegenerative diseases US Patent  US10179761 Publication Date 1/15/2019 
Target
Name:
Sigma non-opioid intracellular receptor 1
Synonyms:
Aging-associated gene 8 protein SGMR1_HUMAN SIGMAR1 SR31747-binding protein Sigma 1-type opioid receptor Sigma1R | hSigmaR1
Type:
Enzyme Catalytic Domain
Mol. Mass.:
25124.85
Organism:
Homo sapiens (Human)
Description:
Q99720
Residue:
223
  
Inhibitor
Name:
BDBM321267
Synonyms:
N-[3-(benzylmethylamino)propyl]-4-chlorobenzamide | US10179761, Compound 3.1.10
Type:
Small organic molecule
Emp. Form.:
C18H21ClN2O
Mol. Mass.:
316.825
SMILES:
CN(CCCNC(=O)c1ccc(Cl)cc1)Cc1ccccc1
: