Target
P2X purinoceptor 3
Ligand
BDBM320246
Substrate
Meas. Tech.
Intracellular Calcium Measurement to Assess Antagonist Activity at Human P2X3 and Human P2X2/3 Receptors
IC50
597±n/a nM
Citation
 Davenport, AJBräuer, NFischer, OMRotgeri, ARottmann, ANeagoe, INagel, JGodinho-Coelho, AKlar, J 1,3-thiazol-2-yl substituted benzamides US Patent  US10183937 Publication Date 1/22/2019 
Target
Name:
P2X purinoceptor 3
Synonyms:
ATP receptor P2RX3 P2X purinoceptor 3 P2X purinoceptor 3 (P2X3) P2X3 purinoceptor p2x3 + hsa
Type:
Protein
Mol. Mass.:
44292.02
Organism:
Homo sapiens (Human)
Description:
P56373
Residue:
397
  
Inhibitor
Name:
BDBM320246
Synonyms:
3-(5-methyl- 1,3-thiazol-2- yl)-5-[(2R)- morpholin-2- ylmethoxy]-N- {(1S)-1-[2- (trifluoromethyl) pyrimidin-5-yl] ethyl}benzamide US10202369, Example 413 | US10472354, Example 413
Type:
Small organic molecule
Emp. Form.:
C23H24F3N5O3S
Mol. Mass.:
507.529
SMILES:
C[C@H](NC(=O)c1cc(OC[C@H]2CNCCO2)cc(c1)-c1ncc(C)s1)c1cnc(nc1)C(F)(F)F
: