Target
Neuronal acetylcholine receptor subunit alpha-7
Ligand
BDBM322217
Substrate
Meas. Tech.
Human alpha7 nAChR Binding Assay
Ki
380±n/a nM
Citation
 Acharya, RBurnett, DABursavich, MGCook, ASHarrison, BAKoenig, GMcriner, AJ Geminal substituted quinuclidine amide compounds as agonists of α-7 nicotonic acetylcholine receptors US Patent  US10183938 Publication Date 1/22/2019 
Target
Name:
Neuronal acetylcholine receptor subunit alpha-7
Synonyms:
ACHA7_HUMAN Cholinergic, Nicotinic Alpha7 Neuronal acetylcholine receptor protein alpha-7 subunit Nicotinic acetylcholine receptor alpha-7 (alpha7 nAChR)
Type:
Mol. Mass.:
56448.33
Organism:
Homo sapiens (Human)
Description:
CHRNA7 (NACHRA7)
Residue:
502
  
Inhibitor
Name:
BDBM322217
Synonyms:
(R)-N-(2,2-dimethylquinuclidin-3-yl)-6-methylbenzo[b]thiophene-2-carboxamide | US10183938, Compound (R)-15
Type:
Small organic molecule
Emp. Form.:
C19H24N2OS
Mol. Mass.:
328.472
SMILES:
Cc1ccc2cc(sc2c1)C(=O)N[C@@H]1C2CCN(CC2)C1(C)C
: