Target
Somatostatin receptor type 3
Ligand
BDBM322581
Substrate
Meas. Tech.
Radioligand Binding Assays
Ki
8620±n/a nM
Citation
 Mazzaferro, RFerrara, MGiovannini, RLingard, I Aryl and heteroaryl-fused tetrahydro-1,4-oxazepine amides as somatostatin receptor subtype 4 (SSTR4) agonists US Patent  US10183940 Publication Date 1/22/2019 
Target
Name:
Somatostatin receptor type 3
Synonyms:
SOMATOSTATIN SST3 SS3-R SSR-28 SSTR3 | Somatostatin receptor type 3 (SSTR3)
Type:
Protein
Mol. Mass.:
45855.97
Organism:
Homo sapiens (Human)
Description:
P32745
Residue:
418
  
Inhibitor
Name:
BDBM322581
Synonyms:
US10183940, Example 33
Type:
Small organic molecule
Emp. Form.:
C21H24N4O2
Mol. Mass.:
364.4409
SMILES:
Cc1cccc2c(n[nH]c12)C(C)(C)NC(=O)c1cccc2CNCCOc12
: