Target
Tyrosine-protein kinase JAK2
Ligand
BDBM322894
Substrate
Meas. Tech.
Inhibition of Enzymatic JAK2 Kinase Activity
IC50
<10±n/a nM
Citation
 Venkatesan, ASmith, RASubramanya, HPotluri, VPanigrahi, SKBasetti, VKunta, K Pyrimido-pyridazinone compounds and methods of use thereof US Patent  US10183944 Publication Date 1/22/2019 
Target
Name:
Tyrosine-protein kinase JAK2
Synonyms:
JAK-2 JAK2_HUMAN Janus kinase 2 (JAK2) | Janus kinase 2 (a protein tyrosine kinase)
Type:
Protein
Mol. Mass.:
130684.68
Organism:
Homo sapiens (Human)
Description:
O60674
Residue:
1132
  
Inhibitor
Name:
BDBM322894
Synonyms:
2-(1-(4-((4-(4-(2-hydroxyethyl)-1,4- diazepan-1-yl)phenyl)amino)-5-oxo-5,6- dihydropyrimido[4,5-d]pyridazin-2-yl) piperidin-4-yl)acetonitrile US10647720, Ex. # 264
Type:
Small organic molecule
Emp. Form.:
C26H33N9O2
Mol. Mass.:
503.5993
SMILES:
OCCN1CCCN(CC1)c1ccc(Nc2nc(nc3cn[nH]c(=O)c23)N2CCC(CC#N)CC2)cc1
: