Target
Arachidonate 5-lipoxygenase-activating protein
Ligand
BDBM323023
Substrate
Meas. Tech.
FLAP Binding Assay (Test A)
IC50
6.30±n/a nM
Citation
 Broddefalk, JOEmtenäs, HFGranberg, KLLemurell, MAPettersen, DTPlowright, ATUlander, LJ Pyrazole derivatives useful as 5-lipoxygenase activating protein (FLAP) inhibitors US Patent  US10183947 Publication Date 1/22/2019 
Target
Name:
Arachidonate 5-lipoxygenase-activating protein
Synonyms:
5-lipoxygenase activating protein 5-lipoxygenase/FLAP ALOX5AP MK-886-binding protein
Type:
Enzyme
Mol. Mass.:
18159.90
Organism:
Homo sapiens (Human)
Description:
P20292
Residue:
161
  
Inhibitor
Name:
BDBM323023
Synonyms:
(1R,2R)-2-[4-(3-Methyl-1H-pyrazol-5- yl)benzoyl]-N-(4-oxo-4,5,6,7- tetrahydropyrazolo[1,5-a]pyrazin-3- yl)cyclohexanecarboxamide US10508119, Example 7 US11691978, Example 7
Type:
Small organic molecule
Emp. Form.:
C24H26N6O3
Mol. Mass.:
446.5016
SMILES:
Cc1cc([nH]n1)-c1ccc(cc1)C(=O)[C@@H]1CCCC[C@H]1C(=O)Nc1cnn2CCNC(=O)c12
: