Target
Orexin/Hypocretin receptor type 1
Ligand
BDBM143742
Substrate
Meas. Tech.
Rat and Human Orexin 1 Receptor Radioligand Binding Studies
Ki
74.0±n/a nM
Citation
 Gelin, CFLebold, TPShireman, BTZiff, JM Substituted 2-azabicycles and their use as orexin receptor modulators US Patent  US10183953 Publication Date 1/22/2019 
Target
Name:
Orexin/Hypocretin receptor type 1
Synonyms:
Hcrtr1 OX1R_RAT Orexin receptor type 1 (OX1R) Ox1-R | Ox1R
Type:
Protein
Mol. Mass.:
46817.55
Organism:
Rattus norvegicus (Rat)
Description:
P56718
Residue:
416
  
Inhibitor
Name:
BDBM143742
Synonyms:
US10183953, Example 1 US9611277, Example 1 | US9845333, 1
Type:
Small organic molecule
Emp. Form.:
C20H17F3N6O2
Mol. Mass.:
430.3832
SMILES:
FC(F)(F)c1cnc(OC2CC3CC2N(C3)C(=O)c2ccccc2-n2nccn2)cn1
: