Target
Orexin/Hypocretin receptor type 1
Ligand
BDBM143742
Substrate
Meas. Tech.
Human Orexin 1 Receptor Ca2+ Mobilization Assay
Ki
120±n/a nM
Citation
 Gelin, CFLebold, TPShireman, BTZiff, JM Substituted 2-azabicycles and their use as orexin receptor modulators US Patent  US10183953 Publication Date 1/22/2019 
Target
Name:
Orexin/Hypocretin receptor type 1
Synonyms:
HCRTR1 OX1R_HUMAN Orexin receptor type 1 (OR 1) Orexin receptor type 1 (OX1) Orexin receptor type 1 (OxR1) | Ox1r
Type:
Protein
Mol. Mass.:
47554.50
Organism:
Homo sapiens (Human)
Description:
O43613
Residue:
425
  
Inhibitor
Name:
BDBM143742
Synonyms:
US10183953, Example 1 US9611277, Example 1 | US9845333, 1
Type:
Small organic molecule
Emp. Form.:
C20H17F3N6O2
Mol. Mass.:
430.3832
SMILES:
FC(F)(F)c1cnc(OC2CC3CC2N(C3)C(=O)c2ccccc2-n2nccn2)cn1
: