Target
Dual specificity mitogen-activated protein kinase kinase 1 [K97R]
Ligand
BDBM200387
Substrate
Meas. Tech.
Radioactive Binding Assay
IC50
16.0±n/a nM
Citation
 Bock, MGMoebitz, HPanigrahi, SKPoddutoori, RSamajdar, S Compounds and compositions as inhibitors of MEK US Patent  US9629836 Publication Date 4/25/2017 
Target
Name:
Dual specificity mitogen-activated protein kinase kinase 1 [K97R]
Synonyms:
Dual specificity mitogen-activated protein kinase kinase 1 (MEK1)(K97R) MEK1 MP2K1_HUMAN | PRKMK1
Type:
Mol. Mass.:
43467.04
Organism:
Homo sapiens (Human)
Description:
Biotinylated full length MEK1 with an inactivating K97R ATP binding site mutation.
Residue:
393
  
Inhibitor
Name:
BDBM200387
Synonyms:
US10011599, Example 15 US9629836, 15
Type:
Small organic molecule
Emp. Form.:
C29H28ClFN6O2
Mol. Mass.:
547.023
SMILES:
Cc1ccnc(Oc2ccc(c(Cl)c2)-c2cc3c4n(cnc4cnc3cc2F)C2(C)CCN(CCO)CC2)n1
: