Target
Dual specificity mitogen-activated protein kinase kinase 1 [K97R]
Ligand
BDBM200390
Substrate
Meas. Tech.
Radioactive Binding Assay
IC50
13.0±n/a nM
Citation
 Bock, MGMoebitz, HPanigrahi, SKPoddutoori, RSamajdar, S Compounds and compositions as inhibitors of MEK US Patent  US9629836 Publication Date 4/25/2017 
Target
Name:
Dual specificity mitogen-activated protein kinase kinase 1 [K97R]
Synonyms:
Dual specificity mitogen-activated protein kinase kinase 1 (MEK1)(K97R) MEK1 MP2K1_HUMAN | PRKMK1
Type:
Mol. Mass.:
43467.04
Organism:
Homo sapiens (Human)
Description:
Biotinylated full length MEK1 with an inactivating K97R ATP binding site mutation.
Residue:
393
  
Inhibitor
Name:
BDBM200390
Synonyms:
US10011599, Example 18 US9629836, 18
Type:
Small organic molecule
Emp. Form.:
C30H31FN6O3
Mol. Mass.:
542.6039
SMILES:
COc1cc(Oc2nccc(C)n2)ccc1-c1cc2c3n(cnc3cnc2cc1F)C1(C)CCN(CCO)CC1
: