Target
Dual specificity mitogen-activated protein kinase kinase 1 [K97R]
Ligand
BDBM200401
Substrate
Meas. Tech.
Radioactive Binding Assay
IC50
19.0±n/a nM
Citation
 Bock, MGMoebitz, HPanigrahi, SKPoddutoori, RSamajdar, S Compounds and compositions as inhibitors of MEK US Patent  US9629836 Publication Date 4/25/2017 
Target
Name:
Dual specificity mitogen-activated protein kinase kinase 1 [K97R]
Synonyms:
Dual specificity mitogen-activated protein kinase kinase 1 (MEK1)(K97R) MEK1 MP2K1_HUMAN | PRKMK1
Type:
Mol. Mass.:
43467.04
Organism:
Homo sapiens (Human)
Description:
Biotinylated full length MEK1 with an inactivating K97R ATP binding site mutation.
Residue:
393
  
Inhibitor
Name:
BDBM200401
Synonyms:
US10011599, Example 29 US9629836, 29
Type:
Small organic molecule
Emp. Form.:
C30H28ClFN6O3
Mol. Mass.:
575.033
SMILES:
CC(O)C(=O)N1CCC(CC1)n1c(C)nc2cnc3cc(F)c(cc3c12)-c1ccc(Oc2nccc(C)n2)cc1Cl
: