Target
Dual specificity mitogen-activated protein kinase kinase 1 [K97R]
Ligand
BDBM200420
Substrate
Meas. Tech.
Radioactive Binding Assay
IC50
1.70±n/a nM
Citation
 Bock, MGMoebitz, HPanigrahi, SKPoddutoori, RSamajdar, S Compounds and compositions as inhibitors of MEK US Patent  US9629836 Publication Date 4/25/2017 
Target
Name:
Dual specificity mitogen-activated protein kinase kinase 1 [K97R]
Synonyms:
Dual specificity mitogen-activated protein kinase kinase 1 (MEK1)(K97R) MEK1 MP2K1_HUMAN | PRKMK1
Type:
Mol. Mass.:
43467.04
Organism:
Homo sapiens (Human)
Description:
Biotinylated full length MEK1 with an inactivating K97R ATP binding site mutation.
Residue:
393
  
Inhibitor
Name:
BDBM200420
Synonyms:
US10011599, Example 47 US9629836, 47
Type:
Small organic molecule
Emp. Form.:
C29H24ClF2N5O3
Mol. Mass.:
563.982
SMILES:
Cc1nc2cnc3cc(F)c(cc3c2n1C1CCN(CC1)C(=O)CO)-c1ccc(Oc2cccc(F)n2)cc1Cl
: