Target
Dual specificity mitogen-activated protein kinase kinase 1 [K97R]
Ligand
BDBM323134
Substrate
Meas. Tech.
Radioactive Binding Assay
IC50
3.00±n/a nM
Citation
 Bock, MGMoebitz, HPanigrahi, SKPoddutoori, RSamajdar, S Compounds and compositions as inhibitors of MEK US Patent  US9629836 Publication Date 4/25/2017 
Target
Name:
Dual specificity mitogen-activated protein kinase kinase 1 [K97R]
Synonyms:
Dual specificity mitogen-activated protein kinase kinase 1 (MEK1)(K97R) MEK1 MP2K1_HUMAN | PRKMK1
Type:
Mol. Mass.:
43467.04
Organism:
Homo sapiens (Human)
Description:
Biotinylated full length MEK1 with an inactivating K97R ATP binding site mutation.
Residue:
393
  
Inhibitor
Name:
BDBM323134
Synonyms:
US10011599, Example 58 | US9629836, 58
Type:
Small organic molecule
Emp. Form.:
C29H24ClF2N7O
Mol. Mass.:
559.997
SMILES:
Cc1nc2cnc3cc(F)c(cc3c2n1[C@H]1CCN(CC#N)CC1F)-c1ccc(Oc2nccc(C)n2)cc1Cl
: