Target
Dual specificity mitogen-activated protein kinase kinase 1 [K97R]
Ligand
BDBM200450
Substrate
Meas. Tech.
Radioactive Binding Assay
IC50
9.20±n/a nM
Citation
 Bock, MGMoebitz, HPanigrahi, SKPoddutoori, RSamajdar, S Compounds and compositions as inhibitors of MEK US Patent  US9629836 Publication Date 4/25/2017 
Target
Name:
Dual specificity mitogen-activated protein kinase kinase 1 [K97R]
Synonyms:
Dual specificity mitogen-activated protein kinase kinase 1 (MEK1)(K97R) MEK1 MP2K1_HUMAN | PRKMK1
Type:
Mol. Mass.:
43467.04
Organism:
Homo sapiens (Human)
Description:
Biotinylated full length MEK1 with an inactivating K97R ATP binding site mutation.
Residue:
393
  
Inhibitor
Name:
BDBM200450
Synonyms:
US10011599, Example 79 US9629836, 79
Type:
Small organic molecule
Emp. Form.:
C28H25F2N7O2
Mol. Mass.:
529.5406
SMILES:
Cc1ccnc(Oc2ccc(c(F)c2)-c2cc3c4n(cnc4cnc3cc2F)C2(C)CCN(CC2)C(N)=O)n1
: