Target
Dual specificity mitogen-activated protein kinase kinase 1 [K97R]
Ligand
BDBM200456
Substrate
Meas. Tech.
Radioactive Binding Assay
IC50
11.0±n/a nM
Citation
 Bock, MGMoebitz, HPanigrahi, SKPoddutoori, RSamajdar, S Compounds and compositions as inhibitors of MEK US Patent  US9629836 Publication Date 4/25/2017 
Target
Name:
Dual specificity mitogen-activated protein kinase kinase 1 [K97R]
Synonyms:
Dual specificity mitogen-activated protein kinase kinase 1 (MEK1)(K97R) MEK1 MP2K1_HUMAN | PRKMK1
Type:
Mol. Mass.:
43467.04
Organism:
Homo sapiens (Human)
Description:
Biotinylated full length MEK1 with an inactivating K97R ATP binding site mutation.
Residue:
393
  
Inhibitor
Name:
BDBM200456
Synonyms:
US10011599, Example 85 US9629836, 85
Type:
Small organic molecule
Emp. Form.:
C28H22ClF2N7O
Mol. Mass.:
545.97
SMILES:
Cc1nc2cnc3cc(F)c(cc3c2n1[C@H]1CCN(CC#N)CC1F)-c1ccc(Oc2ncccn2)cc1Cl
: