Target
Dual specificity mitogen-activated protein kinase kinase 1 [K97R]
Ligand
BDBM200470
Substrate
Meas. Tech.
Radioactive Binding Assay
IC50
8.50±n/a nM
Citation
 Bock, MGMoebitz, HPanigrahi, SKPoddutoori, RSamajdar, S Compounds and compositions as inhibitors of MEK US Patent  US9629836 Publication Date 4/25/2017 
Target
Name:
Dual specificity mitogen-activated protein kinase kinase 1 [K97R]
Synonyms:
Dual specificity mitogen-activated protein kinase kinase 1 (MEK1)(K97R) MEK1 MP2K1_HUMAN | PRKMK1
Type:
Mol. Mass.:
43467.04
Organism:
Homo sapiens (Human)
Description:
Biotinylated full length MEK1 with an inactivating K97R ATP binding site mutation.
Residue:
393
  
Inhibitor
Name:
BDBM200470
Synonyms:
US10011599, Example 99 US9629836, 99
Type:
Small organic molecule
Emp. Form.:
C28H24ClF2N7O4
Mol. Mass.:
595.984
SMILES:
COc1ncnc(Oc2ccc(c(Cl)c2)-c2cc3c4n([C@H]5CCN(C[C@@H]5F)C(=O)CO)c(C)nc4cnc3cc2F)n1
: