Target
Serine/threonine-protein kinase Chk1
Ligand
BDBM323167
Substrate
Meas. Tech.
Kinase Inhibition Asssay
IC50
0.610±n/a nM
Citation
 Boyle, RGBoyce, RJ Pharmaceutically active pyrazine derivatives US Patent  US9630931 Publication Date 4/25/2017 
Target
Name:
Serine/threonine-protein kinase Chk1
Synonyms:
CHEK1 CHK1 checkpoint homolog Checkpoint kinase-1 (CHK1)
Type:
Enzyme Catalytic Domain
Mol. Mass.:
54443.02
Organism:
Homo sapiens (Human)
Description:
gi_166295192
Residue:
476
  
Inhibitor
Name:
BDBM323167
Synonyms:
US9630931, Example 25
Type:
Small organic molecule
Emp. Form.:
C21H26ClN7O4
Mol. Mass.:
475.929
SMILES:
COc1cc(OCCNCCN2CCOCC2)c(Cl)cc1NC(=O)Nc1cnc(cn1)C#N
: