Target
Nuclear receptor ROR-gamma
Ligand
BDBM189916
Substrate
Meas. Tech.
Assay of Co-Activator Recruitment by TR-FRET
pH
7.5±n/a
Temperature
298.15±n/a K
IC50
9.30±n/a nM
Comments
extracted
Citation
 Wennerstål, GMZamaratski, E Methyl- and trifluoromethyl-substituted pyrrolopyridine modulators of RORC2 and methods of use thereof US Patent  US9670201 Publication Date 6/6/2017 
Target
Name:
Nuclear receptor ROR-gamma
Synonyms:
NR1F3 Nuclear receptor ROR-gamma (RORC) RAR-related orphan receptor C (RORc) RORG RZRG Retinoid-related orphan receptor-gamma (RORc)
Type:
Enzyme Catalytic Domain
Mol. Mass.:
58218.40
Organism:
Homo sapiens (Human)
Description:
P51449
Residue:
518
  
Inhibitor
Name:
BDBM189916
Synonyms:
US10227346, Example 39 US9670201, 39 (R)-3-cyano-N-(1,4-dimethyl-3-(1-(2,3,3-trimethylbutanoyl)piperidin-4-yl)-1H-pyrrolo[2,3-b]pyridin-5-yl)-5-methoxybenzamide | US9920054, Example 39
Type:
Small organic molecule
Emp. Form.:
C30H37N5O3
Mol. Mass.:
515.6465
SMILES:
COc1cc(cc(c1)C(=O)Nc1cnc2n(C)cc(C3CCN(CC3)C(=O)[C@H](C)C(C)(C)C)c2c1C)C#N
: