Target
Prostaglandin F2-alpha receptor
Ligand
BDBM323747
Substrate
Meas. Tech.
In Vitro Test of Inhibition of Human FP Receptor Activity (B-1A)
IC50
97.0±n/a nM
Citation
 Beck, HThaler, TKast, RMeibom, DMeininghaus, MTerjung, CDelbeck, MLustig, KMuenster, UOlenik, B Substituted N,2-diarylquinoline-4-carboxamides and the use thereof as anti-inflammatory agents US Patent  US10189788 Publication Date 1/29/2019 
Target
Name:
Prostaglandin F2-alpha receptor
Synonyms:
PF2R_HUMAN PGF2 alpha receptor PTGFR Prostanoid FP receptor
Type:
Enzyme
Mol. Mass.:
40072.29
Organism:
Homo sapiens (Human)
Description:
P43088
Residue:
359
  
Inhibitor
Name:
BDBM323747
Synonyms:
4-{[(6-Bromo-3-methyl-2-phenylquinolin-4-yl)carbonyl]amino}-5-(ethylsulfonyl)-2-methoxybenzoic acid | US10189788, Example 27
Type:
Small organic molecule
Emp. Form.:
C27H23BrN2O6S
Mol. Mass.:
583.45
SMILES:
CCS(=O)(=O)c1cc(C(O)=O)c(OC)cc1NC(=O)c1c(C)c(nc2ccc(Br)cc12)-c1ccccc1
: