Target
Capsid protein
Ligand
BDBM324418
Substrate
Meas. Tech.
BDNA-assay
EC50
<100±n/a nM
Citation
 Hartman, GDKuduk, S Derivatives and methods of treating hepatitis B infections US Patent  US10189835 Publication Date 1/29/2019 
Target
Name:
Capsid protein
Synonyms:
C Core antigen HBcAg | p21.5
Type:
Enzyme Catalytic Domain
Mol. Mass.:
21105.01
Organism:
Hepatitis B virus genotype C subtype ayr (isolate Human/Japan/Okamoto/-) (HBV-C)
Description:
Residue:
183
  
Inhibitor
Name:
BDBM324418
Synonyms:
US10189835, Compound 600
Type:
Small organic molecule
Emp. Form.:
C18H22ClN5O3
Mol. Mass.:
391.852
SMILES:
CC(C)ON(C)C(=O)c1n[nH]c2CCN(Cc12)C(=O)Nc1cccc(Cl)c1
: