Target
Ectonucleotide pyrophosphatase/phosphodiesterase family member 2
Ligand
BDBM192945
Substrate
Meas. Tech.
Human ENPP2 (hENPP2) Assay
pH
8.5±n/a
Temperature
298.15±n/a K
IC50
50±n/a nM
Comments
extracted
Citation
 Desroy, NHeckmann, BBrys, RCJoncour, AMPeixoto, CBock, XM Compounds and pharmaceutical compositions thereof for the treatment of inflammatory disorders US Patent  US9670204 Publication Date 6/6/2017 
Target
Name:
Ectonucleotide pyrophosphatase/phosphodiesterase family member 2
Synonyms:
ATX Autotaxin (ATX) ENPP2 Ectonucleotide Pyrophosphatase/Phosphodiesterase 2 (ENPP2) Extracellular lysophospholipase D PDNP2
Type:
Enzyme
Mol. Mass.:
99007.13
Organism:
Homo sapiens (Human)
Description:
Q13822
Residue:
863
  
Inhibitor
Name:
BDBM192945
Synonyms:
US10526329, Compound 141 US9670204, 140 2-(4-(3-((5-cyano-4-(4-fluorophenyl)thiazol-2-yl)(methyl)amino)-2-ethylimidazo[1,2-a]pyridin-6-yl)piperazin-1-yl)-N,N-dimethylacetamide
Type:
Small organic molecule
Emp. Form.:
C28H31FN8OS
Mol. Mass.:
546.662
SMILES:
CCc1nc2ccc(cn2c1N(C)c1nc(c(s1)C#N)-c1ccc(F)cc1)N1CCN(CC(=O)N(C)C)CC1
: