Target
Ubiquitin carboxyl-terminal hydrolase 1
Ligand
BDBM325140
Substrate
Meas. Tech.
Ubitquin-Rhodamine 110 Assay for USP1 Activity
IC50
<0.002±n/a nM
Citation
 Buckmelter, AJIoannidis, SFollows, BGustafson, GWang, MCaravella, JAWang, ZFritzen, ELLin, J Purinones as ubiquitin-specific protease 1 inhibitors US Patent  US10189841 Publication Date 1/29/2019 
Target
Name:
Ubiquitin carboxyl-terminal hydrolase 1
Synonyms:
Deubiquitinating enzyme 1 USP1 Ubiquitin thioesterase 1 hUBP
Type:
PROTEIN
Mol. Mass.:
88191.62
Organism:
Homo sapiens (Human)
Description:
ChEMBL_104169
Residue:
785
  
Inhibitor
Name:
BDBM325140
Synonyms:
9-(4-(4-((diethylamino)methyl)-1H-1,2,3-triazol-1- US10399980, Compound I-346
Type:
Small organic molecule
Emp. Form.:
C28H32N8O
Mol. Mass.:
496.6067
SMILES:
CCN(CC)Cc1cn(nn1)-c1ccc(Cn2c3nc(ncc3[nH]c2=O)-c2ccccc2C(C)C)cc1
: