Target
Ubiquitin carboxyl-terminal hydrolase 1
Ligand
BDBM325144
Substrate
Meas. Tech.
Ubitquin-Rhodamine 110 Assay for USP1 Activity
IC50
<0.002±n/a nM
Citation
 Buckmelter, AJIoannidis, SFollows, BGustafson, GWang, MCaravella, JAWang, ZFritzen, ELLin, J Purinones as ubiquitin-specific protease 1 inhibitors US Patent  US10189841 Publication Date 1/29/2019 
Target
Name:
Ubiquitin carboxyl-terminal hydrolase 1
Synonyms:
Deubiquitinating enzyme 1 USP1 Ubiquitin thioesterase 1 hUBP
Type:
PROTEIN
Mol. Mass.:
88191.62
Organism:
Homo sapiens (Human)
Description:
ChEMBL_104169
Residue:
785
  
Inhibitor
Name:
BDBM325144
Synonyms:
2-(2-isopropylphenyl)-9-(4-(4-((methylsulfonyl)methyl)- US10399980, Compound I-350
Type:
Small organic molecule
Emp. Form.:
C25H25N7O3S
Mol. Mass.:
503.576
SMILES:
CC(C)c1ccccc1-c1ncc2[nH]c(=O)n(Cc3ccc(cc3)-n3cc(CS(C)(=O)=O)nn3)c2n1
: