Target
Ubiquitin carboxyl-terminal hydrolase 1
Ligand
BDBM325279
Substrate
Meas. Tech.
Ubitquin-Rhodamine 110 Assay for USP1 Activity
IC50
<0.002±n/a nM
Citation
 Buckmelter, AJIoannidis, SFollows, BGustafson, GWang, MCaravella, JAWang, ZFritzen, ELLin, J Purinones as ubiquitin-specific protease 1 inhibitors US Patent  US10189841 Publication Date 1/29/2019 
Target
Name:
Ubiquitin carboxyl-terminal hydrolase 1
Synonyms:
Deubiquitinating enzyme 1 USP1 Ubiquitin thioesterase 1 hUBP
Type:
PROTEIN
Mol. Mass.:
88191.62
Organism:
Homo sapiens (Human)
Description:
ChEMBL_104169
Residue:
785
  
Inhibitor
Name:
BDBM325279
Synonyms:
1-(4-((2-(2- US10399980, Compound I-485 | US11161848, Compound I-485
Type:
Small organic molecule
Emp. Form.:
C27H32N6O3
Mol. Mass.:
488.5814
SMILES:
COCCNC(=O)N(C)c1ccc(Cn2c3nc(ncc3n(C)c2=O)-c2ccccc2C(C)C)cc1
: