Target
5-hydroxytryptamine receptor 4
Ligand
BDBM325599
Substrate
Meas. Tech.
Cell-Based Assay
EC50
116±n/a nM
Citation
 Nirogi, RMohammed, ARYarlagadda, SRavella, SRShinde, AKKambhampati, RRoayapalley, PKJayarajan, PBhyrapuneni, GPatnala, SMRavula, JJasti, V Heteroaryl compounds as 5-HT4 receptor ligands US Patent  US9636335 Publication Date 5/2/2017 
Target
Name:
5-hydroxytryptamine receptor 4
Synonyms:
5-HT-4 5-HT4S 5-HT4b 5-HT4d 5-hydroxytryptamine receptor 4 5HT4R_HUMAN Serotonin (5-HT) receptor Serotonin 4 (5-HT4) receptor | Serotonin Receptor 4
Type:
Enzyme
Mol. Mass.:
43767.54
Organism:
Homo sapiens (Human)
Description:
Q13639
Residue:
388
  
Inhibitor
Name:
BDBM325599
Synonyms:
1-Isopropyl-3-{5-[1-(3-methyl-butyl)-piperidin-4-yl]-[1,3,4]oxadiazol-2-yl}-1H-indazole | US9636335, 40
Type:
Small organic molecule
Emp. Form.:
C22H31N5O
Mol. Mass.:
381.5144
SMILES:
CC(C)CCN1CCC(CC1)c1nnc(o1)-c1nn(C(C)C)c2ccccc12
: