Target
Muscarinic acetylcholine receptor M3
Ligand
BDBM325608
Substrate
Meas. Tech.
M3 Binding Assay
Ki
0.540±n/a nM
Citation
 Amari, GArmani, EBlackaby, WVan De Poeol, HBaker-Glenn, CTrivedi, N Aminoester derivatives US Patent  US9636336 Publication Date 5/2/2017 
Target
Name:
Muscarinic acetylcholine receptor M3
Synonyms:
ACM3_HUMAN Cholinergic, muscarinic M3 Muscarinic receptor M3 | RecName: Full=Muscarinic acetylcholine receptor M3
Type:
Enzyme
Mol. Mass.:
66151.03
Organism:
Homo sapiens (Human)
Description:
P20309
Residue:
590
  
Inhibitor
Name:
BDBM325608
Synonyms:
US9636336, Example 78c
Type:
Small organic molecule
Emp. Form.:
C34H35Cl2N3O7S
Mol. Mass.:
700.629
SMILES:
COc1ccc(cc1OC)[C@H](Cc1c(Cl)c[n+]([O-])cc1Cl)OC(=O)c1ccc(CNC(C(=O)O[C@H]2CCN(C)C2)c2ccccc2)s1
: