Target
Muscarinic acetylcholine receptor M3
Ligand
BDBM325637
Substrate
Meas. Tech.
M3 Binding Assay
IC50
<1±n/a nM
Citation
 Amari, GArmani, EBlackaby, WVan De Poeol, HBaker-Glenn, CTrivedi, N Aminoester derivatives US Patent  US9636336 Publication Date 5/2/2017 
Target
Name:
Muscarinic acetylcholine receptor M3
Synonyms:
ACM3_HUMAN Cholinergic, muscarinic M3 Muscarinic receptor M3 | RecName: Full=Muscarinic acetylcholine receptor M3
Type:
Enzyme
Mol. Mass.:
66151.03
Organism:
Homo sapiens (Human)
Description:
P20309
Residue:
590
  
Inhibitor
Name:
BDBM325637
Synonyms:
US9636336, Example 28 US9636336, Example 95 | [(1S)-2-(3,5-dichloro-1-oxido-pyridin-1-ium-4-yl)-1-(3,4-dimethoxyphenyl)ethyl]5-[[[2-[[(2R)-1-methylazetidin-2-yl]methoxy]-2-oxo-1-phenyl-ethyl]amino]methyl]thiophene-2-carboxylate
Type:
Small organic molecule
Emp. Form.:
C34H35Cl2N3O7S
Mol. Mass.:
700.629
SMILES:
COc1ccc(cc1OC)[C@H](Cc1c(Cl)c[n+]([O-])cc1Cl)OC(=O)c1ccc(CNC(C(=O)OC[C@H]2CCN2C)c2ccccc2)s1
: