Target
Isoform PDE4B2 of cAMP-specific 3',5'-cyclic phosphodiesterase 4B (PDE4B2)
Ligand
BDBM325653
Substrate
Meas. Tech.
HTRF Assay
IC50
<1±n/a nM
Citation
 Amari, GArmani, EBlackaby, WVan De Poeol, HBaker-Glenn, CTrivedi, N Aminoester derivatives US Patent  US9636336 Publication Date 5/2/2017 
Target
Name:
Isoform PDE4B2 of cAMP-specific 3',5'-cyclic phosphodiesterase 4B (PDE4B2)
Synonyms:
DPDE4 PDE4B2 cAMP-specific 3',5'-cyclic phosphodiesterase 4B (PDE4B2) | phosphodiesterase 4B2
Type:
Enzyme
Mol. Mass.:
64320.36
Organism:
Homo sapiens (Human)
Description:
Q07343-2
Residue:
564
  
Inhibitor
Name:
BDBM325653
Synonyms:
US9636336, Example 47 [1-[3-(cyclopropylmethoxy)-4-methoxy-phenyl]-2-(3,5-dichloro-1-oxido-pyridin-1-ium-4-yl)ethyl]5-[[[1-(3-hydroxyphenyl)-2-[(1-methyl-4-piperidyl)methoxy]-2-oxo-ethyl]amino]methyl]thiophene-2-carboxylate
Type:
Small organic molecule
Emp. Form.:
C39H43Cl2N3O8S
Mol. Mass.:
784.745
SMILES:
COc1ccc(cc1OCC1CC1)C(Cc1c(Cl)c[n+]([O-])cc1Cl)OC(=O)c1ccc(CNC(C(=O)OCC2CCN(C)CC2)c2cccc(O)c2)s1
: