Target
Muscarinic acetylcholine receptor M3
Ligand
BDBM325614
Substrate
Meas. Tech.
M3 Binding Assay
IC50
<1±n/a nM
Citation
 Amari, GArmani, EBlackaby, WVan De Poeol, HBaker-Glenn, CTrivedi, N Aminoester derivatives US Patent  US9636336 Publication Date 5/2/2017 
Target
Name:
Muscarinic acetylcholine receptor M3
Synonyms:
ACM3_HUMAN Cholinergic, muscarinic M3 Muscarinic receptor M3 | RecName: Full=Muscarinic acetylcholine receptor M3
Type:
Enzyme
Mol. Mass.:
66151.03
Organism:
Homo sapiens (Human)
Description:
P20309
Residue:
590
  
Inhibitor
Name:
BDBM325614
Synonyms:
US9636336, Example 4 US9636336, Example 56 | [1-[3-(cyclopropylmethoxy)-4-methoxy-phenyl]-2-(3,5-dichloro-1-oxido-pyridin-1-ium-4-yl)ethyl]5-[[[2-[(1-methyl-4-piperidyl)methoxy]-2-oxo-1-phenyl-ethyl]amino]methyl]thiophene-2-carboxylate
Type:
Small organic molecule
Emp. Form.:
C39H43Cl2N3O7S
Mol. Mass.:
768.746
SMILES:
COc1ccc(cc1OCC1CC1)C(Cc1c(Cl)c[n+]([O-])cc1Cl)OC(=O)c1ccc(CNC(C(=O)OCC2CCN(C)CC2)c2ccccc2)s1
: