Target
Metabotropic glutamate receptor 2
Ligand
BDBM212994
Substrate
Meas. Tech.
Biological Assay
IC50
81.0±n/a nM
Citation
 Bungard, CJConverso, ADe Leon, PHanney, BHartingh, TJManikowski, JJManley, PJMeissner, RMeng, ZPerkins, JJRudd, MTShu, Y Quinoline carboxamide and quinoline carbonitrile derivatives as mGluR2-negative allosteric modulators, compositions, and their use US Patent  US9636337 Publication Date 5/2/2017 
Target
Name:
Metabotropic glutamate receptor 2
Synonyms:
GPRC1B GRM2_HUMAN Metabotropic glutamate receptor mGlu2 | metabotropic glutamate 2
Type:
Enzyme
Mol. Mass.:
95584.88
Organism:
Homo sapiens (Human)
Description:
Q14416
Residue:
872
  
Inhibitor
Name:
BDBM212994
Synonyms:
US9278960, 4-78 | US9663506, Example 4-78
Type:
Small organic molecule
Emp. Form.:
C22H24F3N5O2
Mol. Mass.:
447.4535
SMILES:
CC(C)n1cc(cn1)-c1cc(nc2cc(CN3CCOC(C3)C(F)(F)F)ccc12)C(N)=O
: