Target
Metabotropic glutamate receptor 2
Ligand
BDBM213147
Substrate
Meas. Tech.
Biological Assay
IC50
11.0±n/a nM
Citation
 Bungard, CJConverso, ADe Leon, PHanney, BHartingh, TJManikowski, JJManley, PJMeissner, RMeng, ZPerkins, JJRudd, MTShu, Y Quinoline carboxamide and quinoline carbonitrile derivatives as mGluR2-negative allosteric modulators, compositions, and their use US Patent  US9636337 Publication Date 5/2/2017 
Target
Name:
Metabotropic glutamate receptor 2
Synonyms:
GPRC1B GRM2_HUMAN Metabotropic glutamate receptor mGlu2 | metabotropic glutamate 2
Type:
Enzyme
Mol. Mass.:
95584.88
Organism:
Homo sapiens (Human)
Description:
Q14416
Residue:
872
  
Inhibitor
Name:
BDBM213147
Synonyms:
US9278960, 8-54 | US9636337, 8-54
Type:
Small organic molecule
Emp. Form.:
C24H20F2N4O2
Mol. Mass.:
434.438
SMILES:
COc1c(F)cc(cc1F)-c1cc(nc2cc(CCc3cnc(C)nc3)ccc12)C(N)=O
: