Target
Nuclear receptor ROR-gamma [262-507]
Ligand
BDBM326335
Substrate
Meas. Tech.
SPA Binding Assay
IC50
170±n/a nM
Citation
 Duan, JDhar, TGJiang, BKarmakar, AGupta, AKLu, Z Heterocyclic sulfone RORγ modulators US Patent  US9637455 Publication Date 5/2/2017 
Target
Name:
Nuclear receptor ROR-gamma [262-507]
Synonyms:
NR1F3 Nuclear receptor ROR-gamma (aa 262-507) RORC RORG_HUMAN | RZRG
Type:
Enzyme Catalytic Domain
Mol. Mass.:
28605.37
Organism:
Homo sapiens (Human)
Description:
aa 262-507
Residue:
246
  
Inhibitor
Name:
BDBM326335
Synonyms:
US9637455, 1
Type:
Emp. Form.:
C27H21F9O4S
Mol. Mass.:
612.504
SMILES:
Fc1ccc(cc1)S(=O)(=O)C1(CCOCC1)c1ccc(cc1)C(OCc1c(F)cccc1F)(C(F)(F)F)C(F)(F)F
: