Target
Nuclear receptor ROR-gamma [262-507]
Ligand
BDBM325792
Substrate
Meas. Tech.
SPA Binding Assay
IC50
167±n/a nM
Citation
 Duan, JDhar, TGJiang, BKarmakar, AGupta, AKLu, Z Heterocyclic sulfone RORγ modulators US Patent  US9637455 Publication Date 5/2/2017 
Target
Name:
Nuclear receptor ROR-gamma [262-507]
Synonyms:
NR1F3 Nuclear receptor ROR-gamma (aa 262-507) RORC RORG_HUMAN | RZRG
Type:
Enzyme Catalytic Domain
Mol. Mass.:
28605.37
Organism:
Homo sapiens (Human)
Description:
aa 262-507
Residue:
246
  
Inhibitor
Name:
BDBM325792
Synonyms:
US9637455, 8
Type:
Small organic molecule
Emp. Form.:
C36H29F9N2O5S
Mol. Mass.:
772.676
SMILES:
NC(=O)c1ccc(CC(=O)N2CCC(CC2)(c2ccc(cc2)C(OCc2c(F)cccc2F)(C(F)(F)F)C(F)(F)F)S(=O)(=O)c2ccc(F)cc2)cc1
: