Target
Nuclear receptor ROR-gamma [262-507]
Ligand
BDBM325804
Substrate
Meas. Tech.
SPA Binding Assay
IC50
93.0±n/a nM
Citation
 Duan, JDhar, TGJiang, BKarmakar, AGupta, AKLu, Z Heterocyclic sulfone RORγ modulators US Patent  US9637455 Publication Date 5/2/2017 
Target
Name:
Nuclear receptor ROR-gamma [262-507]
Synonyms:
NR1F3 Nuclear receptor ROR-gamma (aa 262-507) RORC RORG_HUMAN | RZRG
Type:
Enzyme Catalytic Domain
Mol. Mass.:
28605.37
Organism:
Homo sapiens (Human)
Description:
aa 262-507
Residue:
246
  
Inhibitor
Name:
BDBM325804
Synonyms:
US9637455, 20
Type:
Small organic molecule
Emp. Form.:
C33H26F9N3O4S
Mol. Mass.:
731.628
SMILES:
Fc1ccc(cc1)S(=O)(=O)C1(CCN(CC1)C(=O)Nc1ccncc1)c1ccc(cc1)C(OCc1c(F)cccc1F)(C(F)(F)F)C(F)(F)F
: