Target
Tyrosine-protein kinase BTK
Ligand
BDBM325942
Substrate
Meas. Tech.
LANCE (Lanthanide Chelate Excite) TR-FRET (Time-resolved fluorescence resonance energy transfer) assay
IC50
9.30±n/a nM
Citation
 Liu, JKim, RMKozlowski, JKrikorian, ADAnand, R Btk inhibitors US Patent  US9637486 Publication Date 5/2/2017 
Target
Name:
Tyrosine-protein kinase BTK
Synonyms:
AGMX1 Agammaglobulinaemia tyrosine kinase B cell progenitor kinase BPK BTK_HUMAN Tyrosine Kinase BTK Tyrosine-protein kinase BTK (BTK)
Type:
Enzyme
Mol. Mass.:
76289.95
Organism:
Homo sapiens (Human)
Description:
Q06187
Residue:
659
  
Inhibitor
Name:
BDBM325942
Synonyms:
3-{(3R)-1-[(2,2- difluorocyclopropyl)carbo- nyl]piperidin-3-yl}-1-(4- phenoxyphenyl)-1H- pyrazolo[3,4-c]pyridin-7- amine | US9637486, Example 4
Type:
Small organic molecule
Emp. Form.:
C27H25F2N5O2
Mol. Mass.:
489.5165
SMILES:
Nc1nccc2c(nn(-c3ccc(Oc4ccccc4)cc3)c12)[C@@H]1CCCN(C1)C(=O)C1CC1(F)F
: