Target
Tyrosine-protein kinase BTK
Ligand
BDBM326004
Substrate
Meas. Tech.
LANCE (Lanthanide Chelate Excite) TR-FRET (Time-resolved fluorescence resonance energy transfer) assay
IC50
1.80±n/a nM
Citation
 Liu, JKim, RMKozlowski, JKrikorian, ADAnand, R Btk inhibitors US Patent  US9637486 Publication Date 5/2/2017 
Target
Name:
Tyrosine-protein kinase BTK
Synonyms:
AGMX1 Agammaglobulinaemia tyrosine kinase B cell progenitor kinase BPK BTK_HUMAN Tyrosine Kinase BTK Tyrosine-protein kinase BTK (BTK)
Type:
Enzyme
Mol. Mass.:
76289.95
Organism:
Homo sapiens (Human)
Description:
Q06187
Residue:
659
  
Inhibitor
Name:
BDBM326004
Synonyms:
3-[(3R)-1-(3- methoxypropanoyl)piperidin- 3-yl]-1-(4- phenoxyphenyl)-1H- pyrazolo[3,4-c]pyridin-7- amine | US9637486, Example 7
Type:
Small organic molecule
Emp. Form.:
C27H29N5O3
Mol. Mass.:
471.5509
SMILES:
COCCC(=O)N1CCC[C@H](C1)c1nn(-c2ccc(Oc3ccccc3)cc2)c2c(N)nccc12
: